Добро пожаловать в форум, Guest  >>   Войти | Регистрация | Поиск | Правила | В избранное | Подписаться
Все форумы / Oracle Новый топик    Ответить
Топик располагается на нескольких страницах: Ctrl  назад   1 2 [3] 4 5 6 7   вперед  Ctrl      все
 Re: Прошу помочь с запуском Listener  [new]
Dobrosvet
Member

Откуда:
Сообщений: 78
Q.Tarantino
Dobrosvet
relink all

[oracle@u5300-app045 bin]$ relink all
writing relink log to: /u01/app/oracle/product/db_1/install/relink.log

а теперь еще раз!
ls -l /u01/app/oracle/product/db_1/bin/oracle

:)
ну и про настройки не забудь... nsswitch, hosts


[oracle@u5300-app045 ~]$ ls -l /u01/app/oracle/product/db_1/bin/oracle
ls: cannot access /u01/app/oracle/product/db_1/bin/oracle: No such file or directory
[oracle@u5300-app045 ~]$ mc


hosts:

[oracle@u5300-app045 ~]$ ls -l /u01/app/oracle/product/db_1/bin/oracle
ls: cannot access /u01/app/oracle/product/db_1/bin/oracle: No such file or directory
[oracle@u5300-app045 ~]$ mc
6 сен 17, 14:52    [20775806]     Ответить | Цитировать Сообщить модератору
 Re: Прошу помочь с запуском Listener  [new]
Dobrosvet
Member

Откуда:
Сообщений: 78
Dobrosvet,

File: nsswitch.conf     Line 11 Col 0      1688 bytes                                   100%
# next entry.
#
# Valid entries include:
#
#       nisplus                 Use NIS+ (NIS version 3)
#       nis                     Use NIS (NIS version 2), also called YP
#       dns                     Use DNS (Domain Name Service)
#       files                   Use the local files
#       db                      Use the local database (.db) files
#       compat                  Use NIS on compat mode
#       hesiod                  Use Hesiod for user lookups
#       [NOTFOUND=return]       Stop searching if not found so far
#

# To use db, put the "db" in front of "files" for entries you want to be
# looked up first in the databases
#
# Example:
#passwd:    db files nisplus nis
#shadow:    db files nisplus nis
#group:     db files nisplus nis

passwd:     files
shadow:     files
group:      files

#hosts:     db files nisplus nis dns
hosts:      files dns

# Example - obey only what nisplus tells us...
#services:   nisplus [NOTFOUND=return] files
#networks:   nisplus [NOTFOUND=return] files
#protocols:  nisplus [NOTFOUND=return] files
#rpc:        nisplus [NOTFOUND=return] files
#ethers:     nisplus [NOTFOUND=return] files
#netmasks:   nisplus [NOTFOUND=return] files

bootparams: nisplus [NOTFOUND=return] files

ethers:     files
netmasks:   files
networks:   files
protocols:  files
rpc:        files
services:   files

netgroup:   nisplus

publickey:  nisplus

automount:  files nisplus
aliases:    files nisplus
6 сен 17, 14:54    [20775815]     Ответить | Цитировать Сообщить модератору
 Re: Прошу помочь с запуском Listener  [new]
Dobrosvet
Member

Откуда:
Сообщений: 78
>Dobrosvet
в директории есть только файл oracle.bin.

имел в виду, что с названием oracle в папке есть только oracle.bin
6 сен 17, 15:14    [20775901]     Ответить | Цитировать Сообщить модератору
 Re: Прошу помочь с запуском Listener  [new]
env
Member

Откуда: Россия, Москва
Сообщений: 6729
Dobrosvet,

cat /u01/app/oracle/product/db_1/install/relink.log
6 сен 17, 15:18    [20775907]     Ответить | Цитировать Сообщить модератору
 Re: Прошу помочь с запуском Listener  [new]
Dobrosvet
Member

Откуда:
Сообщений: 78
env
Dobrosvet,

cat /u01/app/oracle/product/db_1/install/relink.log


[oracle@u5300-app045 u01]$ cat /u01/app/oracle/product/db_1/install/relink.log
Starting Oracle Universal Installer...

Checking swap space: must be greater than 500 MB.   Actual 16095 MB    Passed
Preparing to launch Oracle Universal Installer from /tmp/OraInstall2017-09-06_02-51-39PM. Please wait ...Please find the log file at /u01/app/oracle/product/db_1/install/relinkActions2017-09-06_03-51-40-PM.log
/usr/bin/ar cr /u01/app/oracle/product/db_1/rdbms/lib/libknlopt.a /u01/app/oracle/product/db_1/rdbms/lib/kkpoban.o
/usr/bin/ar cr /u01/app/oracle/product/db_1/rdbms/lib/libknlopt.a /u01/app/oracle/product/db_1/rdbms/lib/kxmwsd.o
rm -f ntcontab.*
(if [ "compile" = "compile" ] ; then \
          /u01/app/oracle/product/db_1/bin/gennttab > ntcontab.c ;\
          gcc -m64  -fPIC -c ntcontab.c ;\
          rm -f /u01/app/oracle/product/db_1/lib/ntcontab.o ;\
          mv ntcontab.o /u01/app/oracle/product/db_1/lib/ ;\
          /usr/bin/ar rv /u01/app/oracle/product/db_1/lib/libn11.a /u01/app/oracle/product/db_1/lib/ntcontab.o ; fi)
/bin/sh: line 2: gcc: command not found
mv: cannot stat `ntcontab.o': No such file or directory
/usr/bin/ar: /u01/app/oracle/product/db_1/lib/ntcontab.o: No such file or directory
make: *** [ntcontab.o] Error 1
Error in invoking target 'mkldflags ntcontab.o nnfgt.o' of makefile '/u01/app/oracle/product/db_1/network/lib/ins_net_client.mk'. See '/u01/app/oracle/product/db_1/install/relinkActions2017-09-06_03-51-40-PM.log' for details.
/u01/app/oracle/product/db_1/bin/genclntsh
/u01/app/oracle/product/db_1/bin/genclntsh: line 305: gcc: command not found
genclntsh: Failed to link libclntsh.so.11.1
make: *** [client_sharedlib] Error 127
Error in invoking target 'client_sharedlib' of makefile '/u01/app/oracle/product/db_1/rdbms/lib/ins_rdbms.mk'. See '/u01/app/oracle/product/db_1/install/relinkActions2017-09-06_03-51-40-PM.log' for details.
/u01/app/oracle/product/db_1/precomp/lib/ins_precomp.mk:19: warning: overriding commands for target `pcscfg.cfg'
/u01/app/oracle/product/db_1/precomp/lib/env_precomp.mk:2160: warning: ignoring old commands for target `pcscfg.cfg'
(cd /u01/app/oracle/product/db_1/precomp/public/; rm -f SQLCA.H)
(cd /u01/app/oracle/product/db_1/precomp/public/; rm -f ORACA.H)
(cd /u01/app/oracle/product/db_1/precomp/public/; rm -f SQLDA.H)
(cd /u01/app/oracle/product/db_1/precomp/public/; rm -f SQLCA.COB)
(cd /u01/app/oracle/product/db_1/precomp/public/; rm -f ORACA.COB)
(cd /u01/app/oracle/product/db_1/precomp/public/; rm -f SQLCA.FOR)
(cd /u01/app/oracle/product/db_1/precomp/public/; rm -f ORACA.FOR)
(cd /u01/app/oracle/product/db_1/precomp/public/; rm -f BNDDSC.FOR)
(cd /u01/app/oracle/product/db_1/precomp/public/; rm -f SELDSC.FOR)
cd /u01/app/oracle/product/db_1/precomp/public/; test ! -f sqlca.h    || ln -s sqlca.h    SQLCA.H
cd /u01/app/oracle/product/db_1/precomp/public/; test ! -f oraca.h    || ln -s oraca.h    ORACA.H
cd /u01/app/oracle/product/db_1/precomp/public/; test ! -f sqlda.h    || ln -s sqlda.h    SQLDA.H
cd /u01/app/oracle/product/db_1/precomp/public/; test ! -f sqlca.cob  || ln -s sqlca.cob  SQLCA.COB
cd /u01/app/oracle/product/db_1/precomp/public/; test ! -f oraca.cob  || ln -s oraca.cob  ORACA.COB
cd /u01/app/oracle/product/db_1/precomp/public/; test ! -f sqlca.for  || ln -s sqlca.for  SQLCA.FOR
cd /u01/app/oracle/product/db_1/precomp/public/; test ! -f oraca.for  || ln -s oraca.for  ORACA.FOR
cd /u01/app/oracle/product/db_1/precomp/public/; test ! -f bnddsc.for || ln -s bnddsc.for BNDDSC.FOR
cd /u01/app/oracle/product/db_1/precomp/public/; test ! -f seldsc.for || ln -s seldsc.for SELDSC.FOR
make -f /u01/app/oracle/product/db_1/precomp/lib/ins_precomp.mk relink EXENAME=proc
make[1]: Entering directory `/u01/app/oracle/product/db_1/precomp/lib'
/u01/app/oracle/product/db_1/precomp/lib/ins_precomp.mk:19: warning: overriding commands for target `pcscfg.cfg'
/u01/app/oracle/product/db_1/precomp/lib/env_precomp.mk:2160: warning: ignoring old commands for target `pcscfg.cfg'
Linking /u01/app/oracle/product/db_1/precomp/lib/proc
/bin/sh: line 2: gcc: command not found
/bin/chmod: cannot access `/u01/app/oracle/product/db_1/precomp/lib/proc': No such file or directory
make[1]: *** [/u01/app/oracle/product/db_1/precomp/lib/proc] Error 1
make: *** [proc] Error 2
Error in invoking target 'links proc gen_pcscfg' of makefile '/u01/app/oracle/product/db_1/precomp/lib/ins_precomp.mk'. See '/u01/app/oracle/product/db_1/install/relinkActions2017-09-06_03-51-40-PM.log' for details.

 - Linking dg4odbc agent
rm -f /u01/app/oracle/product/db_1/rdbms/lib/dg4odbc
gcc -o /u01/app/oracle/product/db_1/rdbms/lib/dg4odbc -m64 -L/u01/app/oracle/product/db_1/rdbms/lib/ -L/u01/app/oracle/product/db_1/lib/ -L/u01/app/oracle/product/db_1/lib/stubs/   /u01/app/oracle/product/db_1/hs/lib/dg4odbc.o                /u01/app/oracle/product/db_1/rdbms/lib/homts.o              -lhgosh11 -lhggcon11 -lhgosh11  -lagtsh -lpthread -lclntsh   `cat /u01/app/oracle/product/db_1/lib/sysliblist` -Wl,-rpath,/u01/app/oracle/product/db_1/lib -lm    `cat /u01/app/oracle/product/db_1/lib/sysliblist` -ldl -lm   -L/u01/app/oracle/product/db_1/lib
/bin/sh: gcc: command not found
make: *** [/u01/app/oracle/product/db_1/rdbms/lib/dg4odbc] Error 127
Error in invoking target 'idg4odbc' of makefile '/u01/app/oracle/product/db_1/rdbms/lib/ins_rdbms.mk'. See '/u01/app/oracle/product/db_1/install/relinkActions2017-09-06_03-51-40-PM.log' for details.
 - Linking
rm -f tnsping
gcc -o tnsping -m64 -L/u01/app/oracle/product/db_1/network/lib/ -L/u01/app/oracle/product/db_1/lib/ -L/u01/app/oracle/product/db_1/lib/stubs/  /u01/app/oracle/product/db_1/network/lib/s0nsping.o /u01/app/oracle/product/db_1/network/lib/nsping.o -lclntsh  `cat /u01/app/oracle/product/db_1/lib/ldflags`    -lncrypt11 -lnsgr11 -lnzjs11 -ln11 -lnl11 -lnro11 `cat /u01/app/oracle/product/db_1/lib/ldflags`    -lncrypt11 -lnsgr11 -lnzjs11 -ln11 -lnl11 -lnnz11 -lzt11 -lztkg11 -lclient11 -lnnetd11  -lvsn11 -lcommon11 -lgeneric11 -lmm -lsnls11 -lnls11  -lcore11 -lsnls11 -lnls11 -lcore11 -lsnls11 -lnls11 -lxml11 -lcore11 -lunls11 -lsnls11 -lnls11 -lcore11 -lnls11 `cat /u01/app/oracle/product/db_1/lib/ldflags`    -lncrypt11 -lnsgr11 -lnzjs11 -ln11 -lnl11 -lnro11 `cat /u01/app/oracle/product/db_1/lib/ldflags`    -lncrypt11 -lnsgr11 -lnzjs11 -ln11 -lnl11 -lclient11 -lnnetd11  -lvsn11 -lcommon11 -lgeneric11   -lsnls11 -lnls11  -lcore11 -lsnls11 -lnls11 -lcore11 -lsnls11 -lnls11 -lxml11 -lcore11 -lunls11 -lsnls11 -lnls11 -lcore11 -lnls11 -lclient11 -lnnetd11  -lvsn11 -lcommon11 -lgeneric11 -lsnls11 -lnls11  -lcore11 -lsnls11 -lnls11 -lcore11 -lsnls11 -lnls11 -lxml11 -lcore11 -lunls11 -lsnls11 -lnls11 -lcore11 -lnls11   `cat /u01/app/oracle/product/db_1/lib/sysliblist` -Wl,-rpath,/u01/app/oracle/product/db_1/lib -lm    `cat /u01/app/oracle/product/db_1/lib/sysliblist` -ldl -lm   -L/u01/app/oracle/product/db_1/lib
/bin/sh: gcc: command not found
make: *** [tnsping] Error 127
Error in invoking target 'itnsping' of makefile '/u01/app/oracle/product/db_1/network/lib/ins_net_client.mk'. See '/u01/app/oracle/product/db_1/install/relinkActions2017-09-06_03-51-40-PM.log' for details.
gcc -o ctxload -m64 -L/u01/app/oracle/product/db_1/ctx/lib/ -L/u01/app/oracle/product/db_1/lib/ -L/u01/app/oracle/product/db_1/lib/stubs/  /u01/app/oracle/product/db_1/ctx/lib/sdrz.o -lctxs11 -lctx11 -lctxs11 -lzx11 -lgx11 -lctx11 -lzx11 -lgx11  -lclntsh  `cat /u01/app/oracle/product/db_1/lib/ldflags`    -lncrypt11 -lnsgr11 -lnzjs11 -ln11 -lnl11 -lnro11 `cat /u01/app/oracle/product/db_1/lib/ldflags`    -lncrypt11 -lnsgr11 -lnzjs11 -ln11 -lnl11 -lnnz11 -lzt11 -lztkg11 -lclient11 -lnnetd11  -lvsn11 -lcommon11 -lgeneric11 -lmm -lsnls11 -lnls11  -lcore11 -lsnls11 -lnls11 -lcore11 -lsnls11 -lnls11 -lxml11 -lcore11 -lunls11 -lsnls11 -lnls11 -lcore11 -lnls11 `cat /u01/app/oracle/product/db_1/lib/ldflags`    -lncrypt11 -lnsgr11 -lnzjs11 -ln11 -lnl11 -lnro11 `cat /u01/app/oracle/product/db_1/lib/ldflags`    -lncrypt11 -lnsgr11 -lnzjs11 -ln11 -lnl11 -lclient11 -lnnetd11  -lvsn11 -lcommon11 -lgeneric11   -lsnls11 -lnls11  -lcore11 -lsnls11 -lnls11 -lcore11 -lsnls11 -lnls11 -lxml11 -lcore11 -lunls11 -lsnls11 -lnls11 -lcore11 -lnls11 -lclient11 -lnnetd11  -lvsn11 -lcommon11 -lgeneric11 -lsnls11 -lnls11  -lcore11 -lsnls11 -lnls11 -lcore11 -lsnls11 -lnls11 -lxml11 -lcore11 -lunls11 -lsnls11 -lnls11 -lcore11 -lnls11   `cat /u01/app/oracle/product/db_1/lib/sysliblist` -Wl,-rpath,/u01/app/oracle/product/db_1/lib -lm    `cat /u01/app/oracle/product/db_1/lib/sysliblist` -ldl -lm   -L/u01/app/oracle/product/db_1/lib
/bin/sh: gcc: command not found
make: *** [ctxload] Error 127
Error in invoking target 'install' of makefile '/u01/app/oracle/product/db_1/ctx/lib/ins_ctx.mk'. See '/u01/app/oracle/product/db_1/install/relinkActions2017-09-06_03-51-41-PM.log' for details.
rm -f /u01/app/oracle/product/db_1/racg/lib/racgchsn /u01/app/oracle/product/db_1/racg/lib/racgeut /u01/app/oracle/product/db_1/racg/lib/racgmdb /u01/app/oracle/product/db_1/racg/lib/racgimon /u01/app/oracle/product/db_1/racg/lib/racgmain /u01/app/oracle/product/db_1/racg/lib/racgwrap /u01/app/oracle/product/db_1/racg/lib/racgvip /u01/app/oracle/product/db_1/racg/lib/racgons /u01/app/oracle/product/db_1/racg/lib/racgevtf /u01/app/oracle/product/db_1/racg/lib/usrvip /u01/app/oracle/product/db_1/racg/lib/asmproxy /u01/app/oracle/product/db_1/racg/lib/appvipcfg
/bin/chmod 755 /u01/app/oracle/product/db_1/bin/
/u01/app/oracle/product/db_1/sysman/lib/ins_emagent.mk:113: warning: overriding commands for target `nmosudo'
/u01/app/oracle/product/db_1/sysman/lib/ins_emagent.mk:52: warning: ignoring old commands for target `nmosudo'
make -f /u01/app/oracle/product/db_1/sysman/lib/ins_emagent.mk relink_exe EXENAME=nmo
make[1]: Entering directory `/u01/app/oracle/product/db_1/sysman/lib'
/u01/app/oracle/product/db_1/sysman/lib/ins_emagent.mk:113: warning: overriding commands for target `nmosudo'
/u01/app/oracle/product/db_1/sysman/lib/ins_emagent.mk:52: warning: ignoring old commands for target `nmosudo'
gcc -o /u01/app/oracle/product/db_1/sysman/lib/nmo -L/u01/app/oracle/product/db_1/lib/ -L/u01/app/oracle/product/db_1/sysman/lib/ `cat /u01/app/oracle/product/db_1/lib/sysliblist`  -lm `cat /u01/app/oracle/product/db_1/lib/sysliblist` -ldl -lm -L/u01/app/oracle/product/db_1/lib /u01/app/oracle/product/db_1/sysman/lib/s0nmo.o /u01/app/oracle/product/db_1/sysman/lib/libnmo.a -lcrypt -ldl    `cat /u01/app/oracle/product/db_1/lib/sysliblist` -ldl -lm
/bin/sh: gcc: command not found
make[1]: Leaving directory `/u01/app/oracle/product/db_1/sysman/lib'
make[1]: *** [/u01/app/oracle/product/db_1/sysman/lib/nmo] Error 127
make: *** [nmo] Error 2
Error in invoking target 'nmo' of makefile '/u01/app/oracle/product/db_1/sysman/lib/ins_emagent.mk'. See '/u01/app/oracle/product/db_1/install/relinkActions2017-09-06_03-51-41-PM.log' for details.
/usr/bin/ar cr /u01/app/oracle/product/db_1/rdbms/lib/libknlopt.a /u01/app/oracle/product/db_1/rdbms/lib/kciwcx.o
chmod 755 /u01/app/oracle/product/db_1/bin
rm -f wrap
Linking wrap
gcc -o wrap -m64 -L/u01/app/oracle/product/db_1/plsql/lib/ -L/u01/app/oracle/product/db_1/lib/ -L/u01/app/oracle/product/db_1/lib/stubs/  /u01/app/oracle/product/db_1/plsql/lib/s0plsw.o -lclntsh -lpsa11 -lpls11  -lrt -lplp11 -lplc11 -lslax11  `cat /u01/app/oracle/product/db_1/lib/ldflags`    -lncrypt11 -lnsgr11 -lnzjs11 -ln11 -lnl11 -lnro11 `cat /u01/app/oracle/product/db_1/lib/ldflags`    -lncrypt11 -lnsgr11 -lnzjs11 -ln11 -lnl11 -lnnz11 -lzt11 -lztkg11 -lclient11 -lnnetd11  -lvsn11 -lcommon11 -lgeneric11 -lmm -lsnls11 -lnls11  -lcore11 -lsnls11 -lnls11 -lcore11 -lsnls11 -lnls11 -lxml11 -lcore11 -lunls11 -lsnls11 -lnls11 -lcore11 -lnls11 `cat /u01/app/oracle/product/db_1/lib/ldflags`    -lncrypt11 -lnsgr11 -lnzjs11 -ln11 -lnl11 -lnro11 `cat /u01/app/oracle/product/db_1/lib/ldflags`    -lncrypt11 -lnsgr11 -lnzjs11 -ln11 -lnl11 -lclient11 -lnnetd11  -lvsn11 -lcommon11 -lgeneric11   -lsnls11 -lnls11  -lcore11 -lsnls11 -lnls11 -lcore11 -lsnls11 -lnls11 -lxml11 -lcore11 -lunls11 -lsnls11 -lnls11 -lcore11 -lnls11 -lclient11 -lnnetd11  -lvsn11 -lcommon11 -lgeneric11 -lsnls11 -lnls11  -lcore11 -lsnls11 -lnls11 -lcore11 -lsnls11 -lnls11 -lxml11 -lcore11 -lunls11 -lsnls11 -lnls11 -lcore11 -lnls11 -lpls11  -lrt -loraz -llzopro -lorabz2 -lipp_z -lipp_bz2 -lippdcemerged -lippsemerged -lippdcmerged  -lippsmerged -lippcore    `cat /u01/app/oracle/product/db_1/lib/sysliblist` -Wl,-rpath,/u01/app/oracle/product/db_1/lib -lm    `cat /u01/app/oracle/product/db_1/lib/sysliblist` -laio -lm   -L/u01/app/oracle/product/db_1/lib
/bin/sh: gcc: command not found
make: *** [wrap] Error 127
Error in invoking target 'install' of makefile '/u01/app/oracle/product/db_1/plsql/lib/ins_plsql.mk'. See '/u01/app/oracle/product/db_1/install/relinkActions2017-09-06_03-51-41-PM.log' for details.
/u01/app/oracle/product/db_1/sysman/lib/ins_emagent.mk:113: warning: overriding commands for target `nmosudo'
/u01/app/oracle/product/db_1/sysman/lib/ins_emagent.mk:52: warning: ignoring old commands for target `nmosudo'
make -f /u01/app/oracle/product/db_1/sysman/lib/ins_emagent.mk relink_sharedobj SHAREDOBJ=libnmemso
make[1]: Entering directory `/u01/app/oracle/product/db_1/sysman/lib'
/u01/app/oracle/product/db_1/sysman/lib/ins_emagent.mk:113: warning: overriding commands for target `nmosudo'
/u01/app/oracle/product/db_1/sysman/lib/ins_emagent.mk:52: warning: ignoring old commands for target `nmosudo'
gcc -o /u01/app/oracle/product/db_1/sysman/lib/libnmemso.so -Wl,--whole-archive -shared  -L/u01/app/oracle/product/db_1/lib/ -L/u01/app/oracle/product/db_1/sysman/lib/ -L/u01/app/oracle/product/db_1/lib/stubs/ -L/u01/app/oracle/product/db_1/lib  -L/u01/app/oracle/product/db_1/sysman/lib/ -Wl,-rpath,/u01/app/oracle/product/db_1/lib/:/u01/app/oracle/product/db_1/sysman/lib/ /u01/app/oracle/product/db_1/sysman/lib/libnmem.a  /u01/app/oracle/product/db_1/sysman/lib/libnmer.a /u01/app/oracle/product/db_1/sysman/lib/libnmnl.a /u01/app/oracle/product/db_1/sysman/lib/libnmnp.a /u01/app/oracle/product/db_1/sysman/lib/libnmeu.a  /u01/app/oracle/product/db_1/sysman/lib/libnmeps.a  /u01/app/oracle/product/db_1/sysman/lib/libnmt.a    /u01/app/oracle/product/db_1/sysman/lib/libnml.a /u01/app/oracle/product/db_1/sysman/lib/libnmee.a  /u01/app/oracle/product/db_1/sysman/lib/libnmefmgr.a /u01/app/oracle/product/db_1/sysman/lib/libnmevr.a /u01/app/oracle/product/db_1/sysman/lib/libnmehu.a /u01/app/oracle/product/db_1/sysman/lib/libnmehl.a  /u01/app/oracle/product/db_1/sysman/lib/libnmepm.a  /u01/app/oracle/product/db_1/sysman/lib/libnmecrmgr.a /u01/app/oracle/product/db_1/sysman/lib/libnmedc.a /u01/app/oracle/product/db_1/sysman/lib/libnmosudo.a /u01/app/oracle/product/db_1/sysman/lib/libnmedt.a  /u01/app/oracle/product/db_1/sysman/lib/libnmedm.a /u01/app/oracle/product/db_1/sysman/lib/libnmedr.a /u01/app/oracle/product/db_1/sysman/lib/libnmeb.a  /u01/app/oracle/product/db_1/sysman/lib/libnmec.a   /u01/app/oracle/product/db_1/sysman/lib/libnmesched.a /u01/app/oracle/product/db_1/sysman/lib/libnmectl.a /u01/app/oracle/product/db_1/sysman/lib/libnmejc.a /u01/app/oracle/product/db_1/sysman/lib/libnmej.a -L/u01/app/oracle/product/db_1/jdk/jre/lib/amd64/server -L/u01/app/oracle/product/db_1/jdk/jre/lib/amd64 -z lazyload -ljava -ljvm -lverify -z nolazyload -Wl,-rpath,/u01/app/oracle/product/db_1/lib/:/u01/app/oracle/product/db_1/sysman/lib/:/u01/app/oracle/product/db_1/jdk/jre/lib/amd64/server:/u01/app/oracle/product/db_1/jdk/jre/lib/amd64 /u01/app/oracle/product/db_1/sysman/lib/libnmeclumgr.a /u01/app/oracle/product/db_1/sysman/lib/libnmecluster.a /u01/app/oracle/product/db_1/sysman/lib/libnmexml.a -Wl,--no-whole-archive -lclntsh -lxml11 -lcore11 -lnls11 -lunls11 -lnnz11 -lncrypt11 -ln11 -lpthread -lnsl -lm -ldl -Wl,-rpath,/u01/app/oracle/product/db_1/lib    `cat /u01/app/oracle/product/db_1/lib/sysliblist` -ldl -lm
/bin/sh: gcc: command not found
make[1]: Leaving directory `/u01/app/oracle/product/db_1/sysman/lib'
make[1]: *** [/u01/app/oracle/product/db_1/sysman/lib/libnmemso.so] Error 127
make: *** [libnmemso] Error 2
Error in invoking target 'agent nmhs' of makefile '/u01/app/oracle/product/db_1/sysman/lib/ins_emagent.mk'. See '/u01/app/oracle/product/db_1/install/relinkActions2017-09-06_03-51-41-PM.log' for details.
chmod 755 /u01/app/oracle/product/db_1/bin
rm -f oracle dbv tstshm maxmem orapwd dbfsize cursize genoci extproc extproc32 hsalloci hsots hsdepxa dgmgrl dumpsga mapsga osh sbttest expdp impdp imp exp sqlldr rman   /u01/app/oracle/product/db_1/rdbms/lib/dg4odbc mkpatch /u01/app/oracle/product/db_1/rdbms/lib/dg4adbs /u01/app/oracle/product/db_1/rdbms/lib/dg4db2 /u01/app/oracle/product/db_1/rdbms/lib/dg4ifmx /u01/app/oracle/product/db_1/rdbms/lib/dg4ims  /u01/app/oracle/product/db_1/rdbms/lib/dg4msql   /u01/app/oracle/product/db_1/rdbms/lib/dg4sybs /u01/app/oracle/product/db_1/rdbms/lib/dg4tera /u01/app/oracle/product/db_1/rdbms/lib/dg4vsam nid adrci wrc extjob extjobo jssu genezi kfod amdu kfed grdcscan uidrvci diskmon setasmgid renamedg orion skgxpinfo /u01/app/oracle/product/db_1/rdbms/lib/ksms.s /u01/app/oracle/product/db_1/rdbms/lib/ksms.o

 - Linking DB*Verify utility (dbv)
rm -f /u01/app/oracle/product/db_1/rdbms/lib/dbv
gcc -o /u01/app/oracle/product/db_1/rdbms/lib/dbv -m64 -L/u01/app/oracle/product/db_1/rdbms/lib/ -L/u01/app/oracle/product/db_1/lib/ -L/u01/app/oracle/product/db_1/lib/stubs/   /u01/app/oracle/product/db_1/rdbms/lib/s0kudbv.o  -ldbtools11 -lsnls11 -lunls11 -lnls11 -lclntsh  `cat /u01/app/oracle/product/db_1/lib/ldflags`    -lncrypt11 -lnsgr11 -lnzjs11 -ln11 -lnl11 -lnro11 `cat /u01/app/oracle/product/db_1/lib/ldflags`    -lncrypt11 -lnsgr11 -lnzjs11 -ln11 -lnl11 -lnnz11 -lzt11 -lztkg11 -lclient11 -lnnetd11  -lvsn11 -lcommon11 -lgeneric11 -lmm -lsnls11 -lnls11  -lcore11 -lsnls11 -lnls11 -lcore11 -lsnls11 -lnls11 -lxml11 -lcore11 -lunls11 -lsnls11 -lnls11 -lcore11 -lnls11 `cat /u01/app/oracle/product/db_1/lib/ldflags`    -lncrypt11 -lnsgr11 -lnzjs11 -ln11 -lnl11 -lnro11 `cat /u01/app/oracle/product/db_1/lib/ldflags`    -lncrypt11 -lnsgr11 -lnzjs11 -ln11 -lnl11 -lclient11 -lnnetd11  -lvsn11 -lcommon11 -lgeneric11   -lsnls11 -lnls11  -lcore11 -lsnls11 -lnls11 -lcore11 -lsnls11 -lnls11 -lxml11 -lcore11 -lunls11 -lsnls11 -lnls11 -lcore11 -lnls11 -lclient11 -lnnetd11  -lvsn11 -lcommon11 -lgeneric11 -lsnls11 -lnls11  -lcore11 -lsnls11 -lnls11 -lcore11 -lsnls11 -lnls11 -lxml11 -lcore11 -lunls11 -lsnls11 -lnls11 -lcore11 -lnls11   `cat /u01/app/oracle/product/db_1/lib/sysliblist` -Wl,-rpath,/u01/app/oracle/product/db_1/lib -lm    `cat /u01/app/oracle/product/db_1/lib/sysliblist` -ldl -lm   -L/u01/app/oracle/product/db_1/lib -laio
/bin/sh: gcc: command not found
make: *** [/u01/app/oracle/product/db_1/rdbms/lib/dbv] Error 127
Error in invoking target 'all_no_orcl' of makefile '/u01/app/oracle/product/db_1/rdbms/lib/ins_rdbms.mk'. See '/u01/app/oracle/product/db_1/install/relinkActions2017-09-06_03-51-41-PM.log' for details.
/bin/chmod 755 /u01/app/oracle/product/db_1/bin/
 - Linking trcroute
rm -f trcroute
gcc -o trcroute -m64 -L/u01/app/oracle/product/db_1/network/lib/ -L/u01/app/oracle/product/db_1/lib/ -L/u01/app/oracle/product/db_1/lib/stubs/  /u01/app/oracle/product/db_1/network/lib/s0nur.o /u01/app/oracle/product/db_1/network/lib/nur.o -lclntsh  `cat /u01/app/oracle/product/db_1/lib/ldflags`    -lncrypt11 -lnsgr11 -lnzjs11 -ln11 -lnl11 -lnro11 `cat /u01/app/oracle/product/db_1/lib/ldflags`    -lncrypt11 -lnsgr11 -lnzjs11 -ln11 -lnl11 -lnnz11 -lzt11 -lztkg11 -lclient11 -lnnetd11  -lvsn11 -lcommon11 -lgeneric11 -lmm -lsnls11 -lnls11  -lcore11 -lsnls11 -lnls11 -lcore11 -lsnls11 -lnls11 -lxml11 -lcore11 -lunls11 -lsnls11 -lnls11 -lcore11 -lnls11 `cat /u01/app/oracle/product/db_1/lib/ldflags`    -lncrypt11 -lnsgr11 -lnzjs11 -ln11 -lnl11 -lnro11 `cat /u01/app/oracle/product/db_1/lib/ldflags`    -lncrypt11 -lnsgr11 -lnzjs11 -ln11 -lnl11 -lclient11 -lnnetd11  -lvsn11 -lcommon11 -lgeneric11   -lsnls11 -lnls11  -lcore11 -lsnls11 -lnls11 -lcore11 -lsnls11 -lnls11 -lxml11 -lcore11 -lunls11 -lsnls11 -lnls11 -lcore11 -lnls11 -lclient11 -lnnetd11  -lvsn11 -lcommon11 -lgeneric11 -lsnls11 -lnls11  -lcore11 -lsnls11 -lnls11 -lcore11 -lsnls11 -lnls11 -lxml11 -lcore11 -lunls11 -lsnls11 -lnls11 -lcore11 -lnls11   `cat /u01/app/oracle/product/db_1/lib/sysliblist` -Wl,-rpath,/u01/app/oracle/product/db_1/lib -lm    `cat /u01/app/oracle/product/db_1/lib/sysliblist` -ldl -lm   -L/u01/app/oracle/product/db_1/lib
/bin/sh: gcc: command not found
make: *** [trcroute] Error 127
Error in invoking target 'install' of makefile '/u01/app/oracle/product/db_1/network/lib/ins_net_client.mk'. See '/u01/app/oracle/product/db_1/install/relinkActions2017-09-06_03-51-41-PM.log' for details.
rm -f /u01/app/oracle/product/db_1/lib/libskgxp11.so
cp /u01/app/oracle/product/db_1/lib//libskgxpg.so /u01/app/oracle/product/db_1/lib/libskgxp11.so
/u01/app/oracle/product/db_1/sysman/lib/ins_emagent.mk:113: warning: overriding commands for target `nmosudo'
/u01/app/oracle/product/db_1/sysman/lib/ins_emagent.mk:52: warning: ignoring old commands for target `nmosudo'
make -f /u01/app/oracle/product/db_1/sysman/lib/ins_emagent.mk relink_exe EXENAME=nmb
make[1]: Entering directory `/u01/app/oracle/product/db_1/sysman/lib'
/u01/app/oracle/product/db_1/sysman/lib/ins_emagent.mk:113: warning: overriding commands for target `nmosudo'
/u01/app/oracle/product/db_1/sysman/lib/ins_emagent.mk:52: warning: ignoring old commands for target `nmosudo'
gcc -o /u01/app/oracle/product/db_1/sysman/lib/nmb -L/u01/app/oracle/product/db_1/lib/ -L/u01/app/oracle/product/db_1/sysman/lib/ `cat /u01/app/oracle/product/db_1/lib/sysliblist`  -lm `cat /u01/app/oracle/product/db_1/lib/sysliblist` -ldl -lm -L/u01/app/oracle/product/db_1/lib /u01/app/oracle/product/db_1/sysman/lib/s0nmb.o /u01/app/oracle/product/db_1/sysman/lib/libnmb.a -lcore11     `cat /u01/app/oracle/product/db_1/lib/sysliblist` -ldl -lm
/bin/sh: gcc: command not found
make[1]: Leaving directory `/u01/app/oracle/product/db_1/sysman/lib'
make[1]: *** [/u01/app/oracle/product/db_1/sysman/lib/nmb] Error 127
make: *** [nmb] Error 2
Error in invoking target 'nmb' of makefile '/u01/app/oracle/product/db_1/sysman/lib/ins_emagent.mk'. See '/u01/app/oracle/product/db_1/install/relinkActions2017-09-06_03-51-41-PM.log' for details.
mkdir -p /u01/app/oracle/product/db_1/sqlplus/bin
cp -f /u01/app/oracle/product/db_1/lib/libsqlplus.so \
                /u01/app/oracle/product/db_1/sqlplus/lib/libsqlplus.so
Linking /u01/app/oracle/product/db_1/sqlplus/bin/sqlplus
rm -f /u01/app/oracle/product/db_1/sqlplus/bin/sqlplus
gcc -o /u01/app/oracle/product/db_1/sqlplus/bin/sqlplus -m64 -L/u01/app/oracle/product/db_1/sqlplus/lib/ -L/u01/app/oracle/product/db_1/lib/ -L/u01/app/oracle/product/db_1/lib/stubs/  /u01/app/oracle/product/db_1/sqlplus/lib/s0afimai.o -lsqlplus -lclntsh  `cat /u01/app/oracle/product/db_1/lib/ldflags`    -lncrypt11 -lnsgr11 -lnzjs11 -ln11 -lnl11 -lnro11 `cat /u01/app/oracle/product/db_1/lib/ldflags`    -lncrypt11 -lnsgr11 -lnzjs11 -ln11 -lnl11 -lnnz11 -lzt11 -lztkg11 -lclient11 -lnnetd11  -lvsn11 -lcommon11 -lgeneric11 -lmm -lsnls11 -lnls11  -lcore11 -lsnls11 -lnls11 -lcore11 -lsnls11 -lnls11 -lxml11 -lcore11 -lunls11 -lsnls11 -lnls11 -lcore11 -lnls11 `cat /u01/app/oracle/product/db_1/lib/ldflags`    -lncrypt11 -lnsgr11 -lnzjs11 -ln11 -lnl11 -lnro11 `cat /u01/app/oracle/product/db_1/lib/ldflags`    -lncrypt11 -lnsgr11 -lnzjs11 -ln11 -lnl11 -lclient11 -lnnetd11  -lvsn11 -lcommon11 -lgeneric11   -lsnls11 -lnls11  -lcore11 -lsnls11 -lnls11 -lcore11 -lsnls11 -lnls11 -lxml11 -lcore11 -lunls11 -lsnls11 -lnls11 -lcore11 -lnls11 -lclient11 -lnnetd11  -lvsn11 -lcommon11 -lgeneric11 -lsnls11 -lnls11  -lcore11 -lsnls11 -lnls11 -lcore11 -lsnls11 -lnls11 -lxml11 -lcore11 -lunls11 -lsnls11 -lnls11 -lcore11 -lnls11   `cat /u01/app/oracle/product/db_1/lib/sysliblist` -Wl,-rpath,/u01/app/oracle/product/db_1/lib -lm -lpthread   `cat /u01/app/oracle/product/db_1/lib/sysliblist` -ldl -lm -lpthread  -L/u01/app/oracle/product/db_1/lib
/bin/sh: gcc: command not found
make: *** [/u01/app/oracle/product/db_1/sqlplus/bin/sqlplus] Error 127
Error in invoking target 'install' of makefile '/u01/app/oracle/product/db_1/sqlplus/lib/ins_sqlplus.mk'. See '/u01/app/oracle/product/db_1/install/relinkActions2017-09-06_03-51-41-PM.log' for details.
rm -f ldapadd ldapbind ldapcompare ldapdelete ldapmodify ldapsearch ldapmoddn ldapaddmt ldapmodifymt dsml2ldif
Building client shared library libclntsh.so ...
Call script /u01/app/oracle/product/db_1/bin/genclntsh ...
/u01/app/oracle/product/db_1/bin/genclntsh
/u01/app/oracle/product/db_1/bin/genclntsh: line 305: gcc: command not found
genclntsh: Failed to link libclntsh.so.11.1
make: *** [/u01/app/oracle/product/db_1/lib/libclntsh.so] Error 127
Error in invoking target 'clientonlyinstall' of makefile '/u01/app/oracle/product/db_1/ldap/lib/ins_ldap.mk'. See '/u01/app/oracle/product/db_1/install/relinkActions2017-09-06_03-51-41-PM.log' for details.
 - Linking
rm -f oklist
gcc -o oklist -m64 -L/u01/app/oracle/product/db_1/network/lib/ -L/u01/app/oracle/product/db_1/lib/ -L/u01/app/oracle/product/db_1/lib/stubs/  /u01/app/oracle/product/db_1/network/lib/snauk5pt.o /u01/app/oracle/product/db_1/network/lib/s0nauk5l.o -lclntsh  `cat /u01/app/oracle/product/db_1/lib/ldflags`    -lncrypt11 -lnsgr11 -lnzjs11 -ln11 -lnl11 -lnro11 `cat /u01/app/oracle/product/db_1/lib/ldflags`    -lncrypt11 -lnsgr11 -lnzjs11 -ln11 -lnl11 -lnnz11 -lzt11 -lztkg11 -lclient11 -lnnetd11  -lvsn11 -lcommon11 -lgeneric11 -lmm -lsnls11 -lnls11  -lcore11 -lsnls11 -lnls11 -lcore11 -lsnls11 -lnls11 -lxml11 -lcore11 -lunls11 -lsnls11 -lnls11 -lcore11 -lnls11 `cat /u01/app/oracle/product/db_1/lib/ldflags`    -lncrypt11 -lnsgr11 -lnzjs11 -ln11 -lnl11 -lnro11 `cat /u01/app/oracle/product/db_1/lib/ldflags`    -lncrypt11 -lnsgr11 -lnzjs11 -ln11 -lnl11 -lclient11 -lnnetd11  -lvsn11 -lcommon11 -lgeneric11   -lsnls11 -lnls11  -lcore11 -lsnls11 -lnls11 -lcore11 -lsnls11 -lnls11 -lxml11 -lcore11 -lunls11 -lsnls11 -lnls11 -lcore11 -lnls11 -lclient11 -lnnetd11  -lvsn11 -lcommon11 -lgeneric11 -lsnls11 -lnls11  -lcore11 -lsnls11 -lnls11 -lcore11 -lsnls11 -lnls11 -lxml11 -lcore11 -lunls11 -lsnls11 -lnls11 -lcore11 -lnls11   `cat /u01/app/oracle/product/db_1/lib/sysliblist` -Wl,-rpath,/u01/app/oracle/product/db_1/lib -lm    `cat /u01/app/oracle/product/db_1/lib/sysliblist` -ldl -lm   -L/u01/app/oracle/product/db_1/lib
/bin/sh: gcc: command not found
make: *** [oklist] Error 127
Error in invoking target 'ioklist' of makefile '/u01/app/oracle/product/db_1/network/lib/ins_nau.mk'. See '/u01/app/oracle/product/db_1/install/relinkActions2017-09-06_03-51-41-PM.log' for details.
/u01/app/oracle/product/db_1/srvm/lib/ins_srvm.mk:68: warning: overriding commands for target `libsrvm11.so'
/u01/app/oracle/product/db_1/srvm/lib/ins_srvm.mk:31: warning: ignoring old commands for target `libsrvm11.so'
/u01/app/oracle/product/db_1/srvm/lib/ins_srvm.mk:71: warning: overriding commands for target `libsrvmocr11.so'
/u01/app/oracle/product/db_1/srvm/lib/ins_srvm.mk:34: warning: ignoring old commands for target `libsrvmocr11.so'
/u01/app/oracle/product/db_1/srvm/lib/ins_srvm.mk:74: warning: overriding commands for target `libsrvmhas11.so'
/u01/app/oracle/product/db_1/srvm/lib/ins_srvm.mk:37: warning: ignoring old commands for target `libsrvmhas11.so'

 - Linking Oracle GETCRSHOME tool
gcc -o getcrshome -m64 -L/u01/app/oracle/product/db_1//lib/ -L/u01/app/oracle/product/db_1/lib/ -L/u01/app/oracle/product/db_1/lib/stubs/  -L/u01/app/oracle/product/db_1/rdbms/lib/   /u01/app/oracle/product/db_1/srvm/lib/prgcrshm.o /u01/app/oracle/product/db_1/srvm/lib/sprgcrshm.o -locr11 -locrb11 -locrutl11 -lhasgen11 -lclntsh -lsnls11 -lnls11  -lcore11 -lsnls11 -lnls11 -lcore11 -lsnls11 -lnls11 -lxml11 -lcore11 -lunls11 -lsnls11 -lnls11 -lcore11 -lnls11 -lskgxn2  -lclntsh -lsnls11 -lnls11  -lcore11 -lsnls11 -lnls11 -lcore11 -lsnls11 -lnls11 -lxml11 -lcore11 -lunls11 -lsnls11 -lnls11 -lcore11 -lnls11 `cat /u01/app/oracle/product/db_1/lib/sysliblist` -lasmclntsh11 -lcell11 -lskgxp11 -lclntsh   `cat /u01/app/oracle/product/db_1/lib/sysliblist` -Wl,-rpath,/u01/app/oracle/product/db_1/lib -lm    `cat /u01/app/oracle/product/db_1/lib/sysliblist` -lm -lm   -L/u01/app/oracle/product/db_1/lib
/bin/sh: gcc: command not found
make: *** [getcrshome] Error 127
Error in invoking target 'install' of makefile '/u01/app/oracle/product/db_1/srvm/lib/ins_srvm.mk'. See '/u01/app/oracle/product/db_1/install/relinkActions2017-09-06_03-51-41-PM.log' for details.

 - Linking Import utility (imp)
rm -f /u01/app/oracle/product/db_1/rdbms/lib/imp
gcc -o /u01/app/oracle/product/db_1/rdbms/lib/imp -m64 -L/u01/app/oracle/product/db_1/rdbms/lib/ -L/u01/app/oracle/product/db_1/lib/ -L/u01/app/oracle/product/db_1/lib/stubs/   /u01/app/oracle/product/db_1/rdbms/lib/s0impdrv.o  -ldbtools11 -lclntsh  `cat /u01/app/oracle/product/db_1/lib/ldflags`    -lncrypt11 -lnsgr11 -lnzjs11 -ln11 -lnl11 -lnro11 `cat /u01/app/oracle/product/db_1/lib/ldflags`    -lncrypt11 -lnsgr11 -lnzjs11 -ln11 -lnl11 -lnnz11 -lzt11 -lztkg11 -lclient11 -lnnetd11  -lvsn11 -lcommon11 -lgeneric11 -lmm -lsnls11 -lnls11  -lcore11 -lsnls11 -lnls11 -lcore11 -lsnls11 -lnls11 -lxml11 -lcore11 -lunls11 -lsnls11 -lnls11 -lcore11 -lnls11 `cat /u01/app/oracle/product/db_1/lib/ldflags`    -lncrypt11 -lnsgr11 -lnzjs11 -ln11 -lnl11 -lnro11 `cat /u01/app/oracle/product/db_1/lib/ldflags`    -lncrypt11 -lnsgr11 -lnzjs11 -ln11 -lnl11 -lclient11 -lnnetd11  -lvsn11 -lcommon11 -lgeneric11   -lsnls11 -lnls11  -lcore11 -lsnls11 -lnls11 -lcore11 -lsnls11 -lnls11 -lxml11 -lcore11 -lunls11 -lsnls11 -lnls11 -lcore11 -lnls11 -lclient11 -lnnetd11  -lvsn11 -lcommon11 -lgeneric11 -lsnls11 -lnls11  -lcore11 -lsnls11 -lnls11 -lcore11 -lsnls11 -lnls11 -lxml11 -lcore11 -lunls11 -lsnls11 -lnls11 -lcore11 -lnls11   `cat /u01/app/oracle/product/db_1/lib/sysliblist` -Wl,-rpath,/u01/app/oracle/product/db_1/lib -lm    `cat /u01/app/oracle/product/db_1/lib/sysliblist` -ldl -lm   -L/u01/app/oracle/product/db_1/lib
/bin/sh: gcc: command not found
make: *** [/u01/app/oracle/product/db_1/rdbms/lib/imp] Error 127
Error in invoking target 'utilities' of makefile '/u01/app/oracle/product/db_1/rdbms/lib/ins_rdbms.mk'. See '/u01/app/oracle/product/db_1/install/relinkActions2017-09-06_03-51-41-PM.log' for details.
 - Linking
rm -f okdstry
gcc -o okdstry -m64 -L/u01/app/oracle/product/db_1/network/lib/ -L/u01/app/oracle/product/db_1/lib/ -L/u01/app/oracle/product/db_1/lib/stubs/  /u01/app/oracle/product/db_1/network/lib/snauk5pt.o /u01/app/oracle/product/db_1/network/lib/s0nauk5d.o -lclntsh  `cat /u01/app/oracle/product/db_1/lib/ldflags`    -lncrypt11 -lnsgr11 -lnzjs11 -ln11 -lnl11 -lnro11 `cat /u01/app/oracle/product/db_1/lib/ldflags`    -lncrypt11 -lnsgr11 -lnzjs11 -ln11 -lnl11 -lnnz11 -lzt11 -lztkg11 -lclient11 -lnnetd11  -lvsn11 -lcommon11 -lgeneric11 -lmm -lsnls11 -lnls11  -lcore11 -lsnls11 -lnls11 -lcore11 -lsnls11 -lnls11 -lxml11 -lcore11 -lunls11 -lsnls11 -lnls11 -lcore11 -lnls11 `cat /u01/app/oracle/product/db_1/lib/ldflags`    -lncrypt11 -lnsgr11 -lnzjs11 -ln11 -lnl11 -lnro11 `cat /u01/app/oracle/product/db_1/lib/ldflags`    -lncrypt11 -lnsgr11 -lnzjs11 -ln11 -lnl11 -lclient11 -lnnetd11  -lvsn11 -lcommon11 -lgeneric11   -lsnls11 -lnls11  -lcore11 -lsnls11 -lnls11 -lcore11 -lsnls11 -lnls11 -lxml11 -lcore11 -lunls11 -lsnls11 -lnls11 -lcore11 -lnls11 -lclient11 -lnnetd11  -lvsn11 -lcommon11 -lgeneric11 -lsnls11 -lnls11  -lcore11 -lsnls11 -lnls11 -lcore11 -lsnls11 -lnls11 -lxml11 -lcore11 -lunls11 -lsnls11 -lnls11 -lcore11 -lnls11   `cat /u01/app/oracle/product/db_1/lib/sysliblist` -Wl,-rpath,/u01/app/oracle/product/db_1/lib -lm    `cat /u01/app/oracle/product/db_1/lib/sysliblist` -ldl -lm   -L/u01/app/oracle/product/db_1/lib
/bin/sh: gcc: command not found
make: *** [okdstry] Error 127
Error in invoking target 'iokdstry iokinit' of makefile '/u01/app/oracle/product/db_1/network/lib/ins_nau.mk'. See '/u01/app/oracle/product/db_1/install/relinkActions2017-09-06_03-51-41-PM.log' for details.
/bin/chmod 755 /u01/app/oracle/product/db_1/bin/
 - Linking tnslsnr
rm -f tnslsnr
gcc -o tnslsnr -m64 -L/u01/app/oracle/product/db_1/network/lib/ -L/u01/app/oracle/product/db_1/lib/ -L/u01/app/oracle/product/db_1/lib/stubs/  /u01/app/oracle/product/db_1/network/lib/s0nsgl.o /u01/app/oracle/product/db_1/network/lib/snsglp.o -lclntsh  `cat /u01/app/oracle/product/db_1/lib/ldflags`    -lncrypt11 -lnsgr11 -lnzjs11 -ln11 -lnl11 -lnro11 `cat /u01/app/oracle/product/db_1/lib/ldflags`    -lncrypt11 -lnsgr11 -lnzjs11 -ln11 -lnl11 -lnnz11 -lzt11 -lztkg11 -lclient11 -lnnetd11  -lvsn11 -lcommon11 -lgeneric11 -lmm -lsnls11 -lnls11  -lcore11 -lsnls11 -lnls11 -lcore11 -lsnls11 -lnls11 -lxml11 -lcore11 -lunls11 -lsnls11 -lnls11 -lcore11 -lnls11 `cat /u01/app/oracle/product/db_1/lib/ldflags`    -lncrypt11 -lnsgr11 -lnzjs11 -ln11 -lnl11 -lnro11 `cat /u01/app/oracle/product/db_1/lib/ldflags`    -lncrypt11 -lnsgr11 -lnzjs11 -ln11 -lnl11 -lclient11 -lnnetd11  -lvsn11 -lcommon11 -lgeneric11   -lsnls11 -lnls11  -lcore11 -lsnls11 -lnls11 -lcore11 -lsnls11 -lnls11 -lxml11 -lcore11 -lunls11 -lsnls11 -lnls11 -lcore11 -lnls11 -lclient11 -lnnetd11  -lvsn11 -lcommon11 -lgeneric11 -lsnls11 -lnls11  -lcore11 -lsnls11 -lnls11 -lcore11 -lsnls11 -lnls11 -lxml11 -lcore11 -lunls11 -lsnls11 -lnls11 -lcore11 -lnls11   `cat /u01/app/oracle/product/db_1/lib/sysliblist` -Wl,-rpath,/u01/app/oracle/product/db_1/lib -lm    `cat /u01/app/oracle/product/db_1/lib/sysliblist` -ldl -lm   -L/u01/app/oracle/product/db_1/lib -lons -lnl11  -ln11 -lnlsnr11 -lnlsnrc11 -lnsgr11 -lnms -lncm11 -lnmsp -lpeer -lnro11 -ln11   -lnl11 -lnlsnr11 -lnlsnrc11 -lnms -lncm11 -lnmsp -ln11     -lm
/bin/sh: gcc: command not found
make: *** [tnslsnr] Error 127
Error in invoking target 'install' of makefile '/u01/app/oracle/product/db_1/network/lib/ins_net_server.mk'. See '/u01/app/oracle/product/db_1/install/relinkActions2017-09-06_03-51-41-PM.log' for details.
 - Linking trcroute
rm -f trcroute
gcc -o trcroute -m64 -L/u01/app/oracle/product/db_1/network/lib/ -L/u01/app/oracle/product/db_1/lib/ -L/u01/app/oracle/product/db_1/lib/stubs/  /u01/app/oracle/product/db_1/network/lib/s0nur.o /u01/app/oracle/product/db_1/network/lib/nur.o -lclntsh  `cat /u01/app/oracle/product/db_1/lib/ldflags`    -lncrypt11 -lnsgr11 -lnzjs11 -ln11 -lnl11 -lnro11 `cat /u01/app/oracle/product/db_1/lib/ldflags`    -lncrypt11 -lnsgr11 -lnzjs11 -ln11 -lnl11 -lnnz11 -lzt11 -lztkg11 -lclient11 -lnnetd11  -lvsn11 -lcommon11 -lgeneric11 -lmm -lsnls11 -lnls11  -lcore11 -lsnls11 -lnls11 -lcore11 -lsnls11 -lnls11 -lxml11 -lcore11 -lunls11 -lsnls11 -lnls11 -lcore11 -lnls11 `cat /u01/app/oracle/product/db_1/lib/ldflags`    -lncrypt11 -lnsgr11 -lnzjs11 -ln11 -lnl11 -lnro11 `cat /u01/app/oracle/product/db_1/lib/ldflags`    -lncrypt11 -lnsgr11 -lnzjs11 -ln11 -lnl11 -lclient11 -lnnetd11  -lvsn11 -lcommon11 -lgeneric11   -lsnls11 -lnls11  -lcore11 -lsnls11 -lnls11 -lcore11 -lsnls11 -lnls11 -lxml11 -lcore11 -lunls11 -lsnls11 -lnls11 -lcore11 -lnls11 -lclient11 -lnnetd11  -lvsn11 -lcommon11 -lgeneric11 -lsnls11 -lnls11  -lcore11 -lsnls11 -lnls11 -lcore11 -lsnls11 -lnls11 -lxml11 -lcore11 -lunls11 -lsnls11 -lnls11 -lcore11 -lnls11   `cat /u01/app/oracle/product/db_1/lib/sysliblist` -Wl,-rpath,/u01/app/oracle/product/db_1/lib -lm    `cat /u01/app/oracle/product/db_1/lib/sysliblist` -ldl -lm   -L/u01/app/oracle/product/db_1/lib
/bin/sh: gcc: command not found
make: *** [trcroute] Error 127
Error in invoking target 'itrcroute' of makefile '/u01/app/oracle/product/db_1/network/lib/ins_net_client.mk'. See '/u01/app/oracle/product/db_1/install/relinkActions2017-09-06_03-51-41-PM.log' for details.

 - Linking recovery manager (rman)
rm -f /u01/app/oracle/product/db_1/rdbms/lib/rman
gcc -o /u01/app/oracle/product/db_1/rdbms/lib/rman -m64 -L/u01/app/oracle/product/db_1/rdbms/lib/ -L/u01/app/oracle/product/db_1/lib/ -L/u01/app/oracle/product/db_1/lib/stubs/   /u01/app/oracle/product/db_1/lib/s0main.o /u01/app/oracle/product/db_1/rdbms/lib/sskrmed.o /u01/app/oracle/product/db_1/rdbms/lib/skrmpt.o -ldbtools11 -lclient11 -lsql11 -lpls11  -lrt -lplp11 -lsnls11 -lunls11 -lnls11 -lslax11 -lpls11  -lrt -lplp11 /u01/app/oracle/product/db_1/lib/libplc11.a -lclntsh  `cat /u01/app/oracle/product/db_1/lib/ldflags`    -lncrypt11 -lnsgr11 -lnzjs11 -ln11 -lnl11 -lnro11 `cat /u01/app/oracle/product/db_1/lib/ldflags`    -lncrypt11 -lnsgr11 -lnzjs11 -ln11 -lnl11 -lnnz11 -lzt11 -lztkg11 -lclient11 -lnnetd11  -lvsn11 -lcommon11 -lgeneric11 -lmm -lsnls11 -lnls11  -lcore11 -lsnls11 -lnls11 -lcore11 -lsnls11 -lnls11 -lxml11 -lcore11 -lunls11 -lsnls11 -lnls11 -lcore11 -lnls11 `cat /u01/app/oracle/product/db_1/lib/ldflags`    -lncrypt11 -lnsgr11 -lnzjs11 -ln11 -lnl11 -lnro11 `cat /u01/app/oracle/product/db_1/lib/ldflags`    -lncrypt11 -lnsgr11 -lnzjs11 -ln11 -lnl11 -lclient11 -lnnetd11  -lvsn11 -lcommon11 -lgeneric11   -lsnls11 -lnls11  -lcore11 -lsnls11 -lnls11 -lcore11 -lsnls11 -lnls11 -lxml11 -lcore11 -lunls11 -lsnls11 -lnls11 -lcore11 -lnls11 -lclient11 -lnnetd11  -lvsn11 -lcommon11 -lgeneric11 -lsnls11 -lnls11  -lcore11 -lsnls11 -lnls11 -lcore11 -lsnls11 -lnls11 -lxml11 -lcore11 -lunls11 -lsnls11 -lnls11 -lcore11 -lnls11   `cat /u01/app/oracle/product/db_1/lib/sysliblist` -Wl,-rpath,/u01/app/oracle/product/db_1/lib -lm    `cat /u01/app/oracle/product/db_1/lib/sysliblist` -ldl -lm   -L/u01/app/oracle/product/db_1/lib
/bin/sh: gcc: command not found
make: *** [/u01/app/oracle/product/db_1/rdbms/lib/rman] Error 127
Error in invoking target 'irman ioracle' of makefile '/u01/app/oracle/product/db_1/rdbms/lib/ins_rdbms.mk'. See '/u01/app/oracle/product/db_1/install/relinkActions2017-09-06_03-51-41-PM.log' for details.
6 сен 17, 15:24    [20775917]     Ответить | Цитировать Сообщить модератору
 Re: Прошу помочь с запуском Listener  [new]
env
Member

Откуда: Россия, Москва
Сообщений: 6729
Dobrosvet,

А что в /u01/app/oracle/product/db_1/install/relinkActions2017-09-06_03-51-41-PM.log
6 сен 17, 15:28    [20775925]     Ответить | Цитировать Сообщить модератору
 Re: Прошу помочь с запуском Listener  [new]
env
Member

Откуда: Россия, Москва
Сообщений: 6729
Dobrosvet,

Ну и
автор
/bin/sh: line 2: gcc: command not found

тонко намекает, что что-то у Вас не то
6 сен 17, 15:30    [20775932]     Ответить | Цитировать Сообщить модератору
 Re: Прошу помочь с запуском Listener  [new]
Dobrosvet
Member

Откуда:
Сообщений: 78
env
Dobrosvet,

А что в /u01/app/oracle/product/db_1/install/relinkActions2017-09-06_03-51-41-PM.log



File: relinkAc~-PM.log  Line 697 Col 252   51065 bytes                                                                    100%
_1/rdbms/lib/sskrmed.o /u01/app/oracle/product/db_1/rdbms/lib/skrmpt.o -ldbtools11 -lclient11 -lsql11 -lpls11  -lrt -lplp11 -l
snls11 -lunls11 -lnls11 -lslax11 -lpls11  -lrt -lplp11 /u01/app/oracle/product/db_1/lib/libplc11.a -lclntsh  `cat /u01/app/ora
cle/product/db
INFO: _1/lib/ldflags`    -lncrypt11 -lnsgr11 -lnzjs11 -ln11 -lnl11 -lnro11 `cat /u01/app/oracle/product/db_1/lib/ldflags`    -
lncrypt11 -lnsgr11 -lnzjs11 -ln11 -lnl11 -lnnz11 -lzt11 -lztkg11 -lclient11 -lnnetd11  -lvsn11 -lcommon11 -lgeneric11 -lmm -ls
nls11 -lnls11  -lcore11 -lsnls11 -lnls11 -lcore11 -lsnls11 -lnls11 -lxml11 -lcore11 -lunls11 -lsnls11 -lnls11 -lcore11 -lnls11
 `cat /u01/app/oracle/product/db_1/lib/ldflags`    -lncrypt11 -lnsgr11 -lnzjs11 -ln11 -lnl11 -lnro11 `cat /u01/app/oracle/prod
uct/db_1/lib/l
INFO: dflags`    -lncrypt11 -lnsgr11 -lnzjs11 -ln11 -lnl11 -lclient11 -lnnetd11  -lvsn11 -lcommon11 -lgeneric11   -lsnls11 -ln
ls11  -lcore11 -lsnls11 -lnls11 -lcore11 -lsnls11 -lnls11 -lxml11 -lcore11 -lunls11 -lsnls11 -lnls11 -lcore11 -lnls11 -lclient
11 -lnnetd11  -lvsn11 -lcommon11 -lgeneric11 -lsnls11 -lnls11  -lcore11 -lsnls11 -lnls11 -lcore11 -lsnls11 -lnls11 -lxml11 -lc
ore11 -lunls11 -lsnls11 -lnls11 -lcore11 -lnls11   `cat /u01/app/oracle/product/db_1/lib/sysliblist` -Wl,-rpath,/u01/app/oracl
e/product/db_1
INFO: /lib -lm    `cat /u01/app/oracle/product/db_1/lib/sysliblist` -ldl -lm   -L/u01/app/oracle/product/db_1/lib

INFO: /bin/sh: gcc: command not found

INFO: make: *** [/u01/app/oracle/product/db_1/rdbms/lib/rman] Error 127

INFO: End output from spawned process.
INFO: ----------------------------------
SEVERE: oracle.sysman.oii.oiil.OiilActionException: Error in invoking target 'irman ioracle' of makefile '/u01/app/oracle/prod
uct/db_1/rdbms/lib/ins_rdbms.mk'. See '/u01/app/oracle/product/db_1/install/relinkActions2017-09-06_03-51-41-PM.log' for detai
ls.
        at oracle.sysman.oii.oiis.OiisMakeDeps.invokeMakefile(OiisMakeDeps.java:544)
        at oracle.sysman.oii.oiis.OiisMakeDeps.doRelink(OiisMakeDeps.java:621)
        at oracle.sysman.oii.oiis.OiisMakeDeps.doOperation(OiisMakeDeps.java:802)
        at oracle.sysman.oii.oiis.OiisMakeDeps.main(OiisMakeDeps.java:812)
6 сен 17, 15:33    [20775938]     Ответить | Цитировать Сообщить модератору
 Re: Прошу помочь с запуском Listener  [new]
Dobrosvet
Member

Откуда:
Сообщений: 78
env
Dobrosvet,

Ну и
автор
/bin/sh: line 2: gcc: command not found

тонко намекает, что что-то у Вас не то


К сожалению, намеков системы не понимаю.. Толстокож. В папке /bin есть @sh в котором "Note: Shell commands will not work when you are on a non-local file system."
6 сен 17, 15:36    [20775945]     Ответить | Цитировать Сообщить модератору
 Re: Прошу помочь с запуском Listener  [new]
Dobrosvet
Member

Откуда:
Сообщений: 78
Dobrosvet,

не, вру.

вот так:
File: sh Line 1 Col 0 33 bytes 100%
/bin/sh: symbolic link to `bash'


Он серый и с знаком @
6 сен 17, 15:39    [20775958]     Ответить | Цитировать Сообщить модератору
 Re: Прошу помочь с запуском Listener  [new]
env
Member

Откуда: Россия, Москва
Сообщений: 6729
Dobrosvet,

Package Requirements
6 сен 17, 15:40    [20775961]     Ответить | Цитировать Сообщить модератору
 Re: Прошу помочь с запуском Listener  [new]
env
Member

Откуда: Россия, Москва
Сообщений: 6729
Найдите свою версию ОС (с учётом битности) и убедитесь, что все необходимые пакеты установлены в системе.
6 сен 17, 15:41    [20775963]     Ответить | Цитировать Сообщить модератору
 Re: Прошу помочь с запуском Listener  [new]
Dobrosvet
Member

Откуда:
Сообщений: 78
env
Найдите свою версию ОС (с учётом битности) и убедитесь, что все необходимые пакеты установлены в системе.


Спасибо, сейчас попробую.
6 сен 17, 15:53    [20776010]     Ответить | Цитировать Сообщить модератору
 Re: Прошу помочь с запуском Listener  [new]
Q.Tarantino
Member [заблокирован]

Откуда: Где-то рядом...
Сообщений: 12015
env
Найдите свою версию ОС (с учётом битности) и убедитесь, что все необходимые пакеты установлены в системе.

угу, пакетиков то нету.
если rhel:
yum install gcc
и все остальное что требуется для оракла
6 сен 17, 16:04    [20776042]     Ответить | Цитировать Сообщить модератору
 Re: Прошу помочь с запуском Listener  [new]
Q.Tarantino
Member [заблокирован]

Откуда: Где-то рядом...
Сообщений: 12015
Dobrosvet
hosts:      files dns

тут вроде норм, но короткое имя в /etc/hosts добавь.
было:
10.153.200.45 u5300-app045.regions.tax.nalog.ru

надо
10.153.200.45 u5300-app045.regions.tax.nalog.ru u5300-app045
6 сен 17, 16:06    [20776053]     Ответить | Цитировать Сообщить модератору
 Re: Прошу помочь с запуском Listener  [new]
Dobrosvet
Member

Откуда:
Сообщений: 78
Q.Tarantino
env
Найдите свою версию ОС (с учётом битности) и убедитесь, что все необходимые пакеты установлены в системе.

угу, пакетиков то нету.
если rhel:
yum install gcc
и все остальное что требуется для оракла


[root@u5300-app045 ~]# yum install gcc
Loaded plugins: product-id, security, subscription-manager
This system is not registered to Red Hat Subscription Management. You can use subscription-manager to register.
Setting up Install Process
Nothing to do


host подредактировал
6 сен 17, 16:14    [20776073]     Ответить | Цитировать Сообщить модератору
 Re: Прошу помочь с запуском Listener  [new]
Q.Tarantino
Member [заблокирован]

Откуда: Где-то рядом...
Сообщений: 12015
Dobrosvet
[root@u5300-app045 ~]# yum install gcc
Loaded plugins: product-id, security, subscription-manager
This system is not registered to Red Hat Subscription Management. You can use subscription-manager to register.
Setting up Install Process
Nothing to do

ну тебе же подсказали, сперва выясни что у тебя за ОС :)
линукс админы то есть?
6 сен 17, 16:36    [20776146]     Ответить | Цитировать Сообщить модератору
 Re: Прошу помочь с запуском Listener  [new]
env
Member

Откуда: Россия, Москва
Сообщений: 6729
Dobrosvet,

cat /proc/version
6 сен 17, 16:39    [20776160]     Ответить | Цитировать Сообщить модератору
 Re: Прошу помочь с запуском Listener  [new]
Dobrosvet
Member

Откуда:
Сообщений: 78
Q.Tarantino
Dobrosvet
[root@u5300-app045 ~]# yum install gcc
Loaded plugins: product-id, security, subscription-manager
This system is not registered to Red Hat Subscription Management. You can use subscription-manager to register.
Setting up Install Process
Nothing to do

ну тебе же подсказали, сперва выясни что у тебя за ОС :)
линукс админы то есть?


Я за них :-) Поувольнялись.

Установил gcc с флешки.

[root@u5300-app045 distr]# rpm -i gcc*
warning: gcc-4.4.7-4.el6.x86_64.rpm: Header V3 RSA/SHA256 Signature, key ID fd431d51: NOKEY
        package gcc-4.4.7-4.el6.x86_64 is already installed
        package gcc-c++-4.4.7-4.el6.x86_64 is already installed
6 сен 17, 16:41    [20776177]     Ответить | Цитировать Сообщить модератору
 Re: Прошу помочь с запуском Listener  [new]
env
Member

Откуда: Россия, Москва
Сообщений: 6729
Dobrosvet,

Можно ещё
cat /etc/*-release
6 сен 17, 16:42    [20776182]     Ответить | Цитировать Сообщить модератору
 Re: Прошу помочь с запуском Listener  [new]
Dobrosvet
Member

Откуда:
Сообщений: 78
env
Dobrosvet,

cat /proc/version



[root@u5300-app045 distr]# cat /proc/version
Linux version 2.6.32-431.20.3.el6.x86_64 (mockbuild@x86-012.build.bos.redhat.com) (gcc version 4.4.7 20120313 (Red Hat 4.4.7-4) (GCC) ) #1 SMP Fri Jun 6 18:30:54 EDT 2014
6 сен 17, 16:43    [20776189]     Ответить | Цитировать Сообщить модератору
 Re: Прошу помочь с запуском Listener  [new]
Dobrosvet
Member

Откуда:
Сообщений: 78
env
Dobrosvet,

Можно ещё
cat /etc/*-release


[root@u5300-app045 distr]# cat /etc/*-release
LSB_VERSION=base-4.0-amd64:base-4.0-noarch:core-4.0-amd64:core-4.0-noarch:graphics-4.0-amd64:graphics-4.0-noarch:printing-4.0-amd64:printing-4.0-noarch
Red Hat Enterprise Linux Server release 6.5 (Santiago)
Red Hat Enterprise Linux Server release 6.5 (Santiago)
6 сен 17, 16:45    [20776196]     Ответить | Цитировать Сообщить модератору
 Re: Прошу помочь с запуском Listener  [new]
Q.Tarantino
Member [заблокирован]

Откуда: Где-то рядом...
Сообщений: 12015
Dobrosvet
Установил gcc с флешки.

значит можешь еще раз попробовать relink all под ораклом и посмотреть что там в логе будет по итогу
6 сен 17, 16:52    [20776224]     Ответить | Цитировать Сообщить модератору
 Re: Прошу помочь с запуском Listener  [new]
Dobrosvet
Member

Откуда:
Сообщений: 78
Q.Tarantino
Dobrosvet
Установил gcc с флешки.

значит можешь еще раз попробовать relink all под ораклом и посмотреть что там в логе будет по итогу


+

relink.log [----] 0 L:[151+52 203/203] *(37657/37657b) <EOF>
Error in invoking target 'clientonlyinstall' of makefile '/u01/app/oracle/product/db_1/ldap/lib/ins_ldap.mk'. See '/u01/app/or
- Linking.
rm -f oklist
gcc -o oklist -m64 -L/u01/app/oracle/product/db_1/network/lib/ -L/u01/app/oracle/product/db_1/lib/ -L/u01/app/oracle/product/d
/bin/sh: gcc: command not found
make: *** [oklist] Error 127
Error in invoking target 'ioklist' of makefile '/u01/app/oracle/product/db_1/network/lib/ins_nau.mk'. See '/u01/app/oracle/pro
/u01/app/oracle/product/db_1/srvm/lib/ins_srvm.mk:68: warning: overriding commands for target `libsrvm11.so'
/u01/app/oracle/product/db_1/srvm/lib/ins_srvm.mk:31: warning: ignoring old commands for target `libsrvm11.so'
/u01/app/oracle/product/db_1/srvm/lib/ins_srvm.mk:71: warning: overriding commands for target `libsrvmocr11.so'
/u01/app/oracle/product/db_1/srvm/lib/ins_srvm.mk:34: warning: ignoring old commands for target `libsrvmocr11.so'
/u01/app/oracle/product/db_1/srvm/lib/ins_srvm.mk:74: warning: overriding commands for target `libsrvmhas11.so'
/u01/app/oracle/product/db_1/srvm/lib/ins_srvm.mk:37: warning: ignoring old commands for target `libsrvmhas11.so'

- Linking Oracle GETCRSHOME tool
gcc -o getcrshome -m64 -L/u01/app/oracle/product/db_1//lib/ -L/u01/app/oracle/product/db_1/lib/ -L/u01/app/oracle/product/db_1
/bin/sh: gcc: command not found
make: *** [getcrshome] Error 127
Error in invoking target 'install' of makefile '/u01/app/oracle/product/db_1/srvm/lib/ins_srvm.mk'. See '/u01/app/oracle/produ

- Linking Import utility (imp)
rm -f /u01/app/oracle/product/db_1/rdbms/lib/imp
gcc -o /u01/app/oracle/product/db_1/rdbms/lib/imp -m64 -L/u01/app/oracle/product/db_1/rdbms/lib/ -L/u01/app/oracle/product/db_
/bin/sh: gcc: command not found
make: *** [/u01/app/oracle/product/db_1/rdbms/lib/imp] Error 127
Error in invoking target 'utilities' of makefile '/u01/app/oracle/product/db_1/rdbms/lib/ins_rdbms.mk'. See '/u01/app/oracle/p
- Linking.
rm -f okdstry
gcc -o okdstry -m64 -L/u01/app/oracle/product/db_1/network/lib/ -L/u01/app/oracle/product/db_1/lib/ -L/u01/app/oracle/product/
/bin/sh: gcc: command not found
make: *** [okdstry] Error 127
Error in invoking target 'iokdstry iokinit' of makefile '/u01/app/oracle/product/db_1/network/lib/ins_nau.mk'. See '/u01/app/o
/bin/chmod 755 /u01/app/oracle/product/db_1/bin/
- Linking tnslsnr
rm -f tnslsnr
gcc -o tnslsnr -m64 -L/u01/app/oracle/product/db_1/network/lib/ -L/u01/app/oracle/product/db_1/lib/ -L/u01/app/oracle/product/
/bin/sh: gcc: command not found
make: *** [tnslsnr] Error 127
Error in invoking target 'install' of makefile '/u01/app/oracle/product/db_1/network/lib/ins_net_server.mk'. See '/u01/app/ora
- Linking trcroute
rm -f trcroute
gcc -o trcroute -m64 -L/u01/app/oracle/product/db_1/network/lib/ -L/u01/app/oracle/product/db_1/lib/ -L/u01/app/oracle/product
/bin/sh: gcc: command not found
make: *** [trcroute] Error 127
Error in invoking target 'itrcroute' of makefile '/u01/app/oracle/product/db_1/network/lib/ins_net_client.mk'. See '/u01/app/o

- Linking recovery manager (rman)
rm -f /u01/app/oracle/product/db_1/rdbms/lib/rman
gcc -o /u01/app/oracle/product/db_1/rdbms/lib/rman -m64 -L/u01/app/oracle/product/db_1/rdbms/lib/ -L/u01/app/oracle/product/db
/bin/sh: gcc: command not found
make: *** [/u01/app/oracle/product/db_1/rdbms/lib/rman] Error 127
Error in invoking target 'irman ioracle' of makefile '/u01/app/oracle/product/db_1/rdbms/lib/ins_rdbms.mk'. See '/u01/app/orac
6 сен 17, 17:00    [20776255]     Ответить | Цитировать Сообщить модератору
 Re: Прошу помочь с запуском Listener  [new]
andrey_anonymous
Member

Откуда: Москва
Сообщений: 18370
Dobrosvet
...
gcc -o oklist -m64 -L/u01/app/oracle/product/db_1/network/lib/ -L/u01/app/oracle/product/db_1/lib/ -L/u01/app/oracle/product/d
/bin/sh: gcc: command not found
...

Дальше можно не читать.
Убедитесь, что gcc в путях у пользователя oracle.
6 сен 17, 17:07    [20776278]     Ответить | Цитировать Сообщить модератору
Топик располагается на нескольких страницах: Ctrl  назад   1 2 [3] 4 5 6 7   вперед  Ctrl      все
Все форумы / Oracle Ответить